error openH323

Discussion in 'General' started by alexpoilt, Apr 28, 2009.

  1. alexpoilt

    Joined:
    Dec 16, 2008
    Messages:
    4
    Likes Received:
    0
    Good afternoon,

    I am trying to install openh323-v1_18_0.

    cd / usr / src
    wget http://downloads.sourceforge.net/openh3 ... src-tar.gz
    tar zxvf openh323-v1_18_0-src-tar.gz
    openh323_v1_18_0 cd /
    . / configure
    make

    Only to make it run the following error:

    ixjunix.cxx:2263: error: âconst struct OpalIxJDevice::SetToneFilterParameters(unsigned int, OpalLineInterfaceDevice::CallProgressTones, unsigned int, unsigned int, PINDEX, const unsigned int*, const unsigned int*)::<anonymous>â has no member named âcodeâ
    ixjunix.cxx:2280: error: âstruct IXJ_FILTERâ has no member named âfreqâ
    ixjunix.cxx:2280: error: âIXJ_FILTER_FREQâ was not declared in this scope
    ixjunix.cxx:2280: error: expected `;' before âfilterCodeâ
    make[2]: *** [/usr/src/openh323_v1_18_0/lib/obj_linux_x86_r/ixjunix.o] Error 1
    make[2]: Leaving directory `/usr/src/openh323_v1_18_0/src'
    make[1]: *** [opt] Error 2
    make[1]: Leaving directory `/usr/src/openh323_v1_18_0'
    make: *** [optshared] Error 2

    How can resolve this error.

    thanks,

    Alex
     

Share This Page